{"text_format":"1","workbook":"xlsx","n_sheets":3,"sheets":["Client Output","T-Free Inputs","Calcs"],"not_rendered":{"charts":0,"images":0,"macros":1,"external_links":0,"defined_names":3,"comments":0,"pivot_tables":0},"unopened":[],"bounds":{"document_bytes":16777216,"sheet_cells":100000,"rows_first":2000,"rows_last":500,"rows_between":2000,"halvings":0,"cell_chars":16384,"cell_head_chars":4096},"cells_cut":0,"cells_raw":0,"read":"whole","date_system":"1900"}

{"sheet":"Client Output","index":0,"n_rows":99,"n_cols":28,"rows_kept":99,"cut":false,"hidden":false,"merged":[[1,1,1,3],[1,4,1,5],[2,1,2,2]]}
[]
[null,"                Current Plan vs. Tax-Free Retirement Plan:",null,null,{"$f":"'T-Free Inputs'!C5","v":"Jamie Rossi"}]
[null,"Client Inputs/Assumptions",null,"Comparison Metrics","Current Plan","Tax-Free Plan"]
[null,"Current Age",47,"Acct Value @ Retirement (before tax)",{"$f":"Calcs!D2","v":465266.05122612609},{"$f":"'T-Free Inputs'!C3","v":390747},null,null,null,null,null,null,null,null,null,null,null,null,null,null,null,null,null,null,null,null,0,2.5000000000000001E-2]
[null,"Retirement Age",67,"Tax Liability",{"$f":"IF(C$7=\"Qualified\",E4*C11,0)","v":0},0,null,null,null,null,null,null,null,null,null,null,null,null,null,null,null,null,null,null,null,null,5.0000000000000001E-3,{"$f":"AB4+0.1%","v":2.6000000000000002E-2}]
[null,"Monthly Saving Rate",1000,"After-Tax Bal @ Retirement",{"$f":"+E4-E5","v":465266.05122612609},{"$f":"F4","v":390747},null,null,null,null,null,null,null,null,null,null,null,null,null,null,null,null,null,null,null,null,0.01,{"$f":"AB5+0.1%","v":2.7000000000000003E-2}]
[null,"Account Type","Roth","Income Drawdown Rate",4.0000000000000015E-2,{"$f":"F8/F6","v":0.11565539850593863},null,null,null,null,null,null,null,null,null,null,null,null,null,null,null,null,null,null,null,null,1.4999999999999999E-2,2.8000000000000004E-2]
[null,"Match (if applicable)",0,"Annual Income Draw (After-Tax)",{"$f":"IF(C7=\"taxable\",(E6*E7)-Calcs!F2,(E6*E7))","v":18610.642049045051},{"$f":"'T-Free Inputs'!C4","v":45192},null,null,null,null,null,null,null,null,null,null,null,null,null,null,null,null,null,null,null,null,0.02,2.9000000000000005E-2]
[null,"Inflate Contributions?",1.4999999999999999E-2,"Comparison Summary","Favored Plan","Advantage",null,null,null,null,null,null,null,null,null,null,null,null,null,null,null,null,null,null,null,null,2.5000000000000001E-2,3.0000000000000006E-2]
[null,"Growth Rate (Accumulation)",6.500000000000003E-2,"Annual After-Tax Income Advantage",{"$f":"IF(F8>E8,\"Tax-Free\",\"Current\")","v":"Tax-Free"},{"$f":"F8-E8","v":26581.357950954949},null,null,null,null,null,null,null,null,null,null,null,null,null,null,null,null,null,null,null,null,0.03,3.1000000000000007E-2]
[null,"Tax Rate",0.2,"Income Advantage Multiple (percent)",{"$f":"E10","v":"Tax-Free"},{"$f":"F8/E8","v":2.4282880666290012},null,null,null,null,null,null,null,null,null,null,null,null,null,null,null,null,null,null,null,null,3.5000000000000003E-2,3.2000000000000008E-2]
[null,"Fee/Commission Drain",1.4999999999999999E-2,"Lifestyle Advantage (to age 90)",{"$f":"E11","v":"Tax-Free"},{"$f":"F10*(90-C5)","v":611371.23287196388},null,null,null,null,null,null,null,null,null,null,null,null,null,null,null,null,null,null,null,null,0.04,3.3000000000000008E-2]
[null,null,null,null,null,null,null,null,null,null,null,null,null,null,null,null,null,null,null,null,null,null,null,null,null,null,4.4999999999999998E-2,3.4000000000000009E-2]
[null,null,null,null,null,null,null,null,null,null,null,null,null,null,null,null,null,null,null,null,null,null,null,null,null,null,0.05,3.500000000000001E-2]
[null,null,null,null,null,null,null,null,null,null,null,null,null,null,null,null,null,null,null,null,null,null,null,null,null,null,null,3.6000000000000011E-2]
[null,null,null,null,null,null,null,null,null,null,null,null,null,null,null,null,null,null,null,null,null,null,null,null,null,null,null,3.7000000000000012E-2]
[null,null,null,null,null,null,null,null,null,null,null,null,null,null,null,null,null,null,null,null,null,null,null,null,null,null,null,3.8000000000000013E-2]
[null,null,null,null,null,null,null,null,null,null,null,null,null,null,null,null,null,null,null,null,null,null,null,null,null,null,null,3.9000000000000014E-2]
[null,null,null,null,null,null,null,null,null,null,null,null,null,null,null,null,null,null,null,null,null,null,null,null,null,null,null,4.0000000000000015E-2]
[null,null,null,null,null,null,null,null,null,null,null,null,null,null,null,null,null,null,null,null,null,null,null,null,null,null,null,4.1000000000000016E-2]
[null,null,null,null,null,null,null,null,null,null,null,null,null,null,null,null,null,null,null,null,null,null,null,null,null,null,null,4.2000000000000016E-2]
[null,null,null,null,null,null,null,null,null,null,null,null,null,null,null,null,null,null,null,null,null,null,null,null,null,null,null,4.3000000000000017E-2]
[null,null,null,null,null,null,null,null,null,null,null,null,null,null,null,null,null,null,null,null,null,null,null,null,null,null,null,4.4000000000000018E-2]
[null,null,null,null,null,null,null,null,null,null,null,null,null,null,null,null,null,null,null,null,null,null,null,null,null,null,null,4.5000000000000019E-2]
[null,null,null,null,null,null,null,null,null,null,null,null,null,null,null,null,null,null,null,null,null,null,null,null,null,null,null,4.600000000000002E-2]
[null,null,null,null,null,null,null,null,null,null,null,null,null,null,null,null,null,null,null,null,null,null,null,null,null,null,null,4.7000000000000021E-2]
[null,null,null,null,null,null,null,null,null,null,null,null,null,null,null,null,null,null,null,null,null,null,null,null,null,null,null,4.8000000000000022E-2]
[null,null,null,null,null,null,null,null,null,null,null,null,null,null,null,null,null,null,null,null,null,null,null,null,null,null,null,4.9000000000000023E-2]
[null,null,null,null,null,null,null,null,null,null,null,null,null,null,null,null,null,null,null,null,null,null,null,null,null,null,null,5.0000000000000024E-2]
[null,null,null,null,null,null,null,null,null,null,null,null,null,null,null,null,null,null,null,null,null,null,null,null,null,null,null,5.1000000000000024E-2]
[null,null,null,null,null,null,null,null,null,null,null,null,null,null,null,null,null,null,null,null,null,null,null,null,null,null,null,5.2000000000000025E-2]
[null,null,null,null,null,null,null,null,null,null,null,null,null,null,null,null,null,null,null,null,null,null,null,null,null,null,null,5.3000000000000026E-2]
[null,null,null,null,null,null,null,null,null,null,null,null,null,null,null,null,null,null,null,null,null,null,null,null,null,null,null,5.4000000000000027E-2]
[null,null,null,null,null,null,null,null,null,null,null,null,null,null,null,null,null,null,null,null,null,null,null,null,null,null,null,5.5000000000000028E-2]
[null,null,null,null,null,null,null,null,null,null,null,null,null,null,null,null,null,null,null,null,null,null,null,null,null,null,null,5.6000000000000029E-2]
[null,null,null,null,null,null,null,null,null,null,null,null,null,null,null,null,null,null,null,null,null,null,null,null,null,null,null,5.700000000000003E-2]
[null,null,null,null,null,null,null,null,null,null,null,null,null,null,null,null,null,null,null,null,null,null,null,null,null,null,null,5.8000000000000031E-2]
[null,null,null,null,null,null,null,null,null,null,null,null,null,null,null,null,null,null,null,null,null,null,null,null,null,null,null,5.9000000000000032E-2]
[null,null,null,null,null,null,null,null,null,null,null,null,null,null,null,null,null,null,null,null,null,null,null,null,null,null,null,6.0000000000000032E-2]
[null,null,null,null,null,null,null,null,null,null,null,null,null,null,null,null,null,null,null,null,null,null,null,null,null,null,null,6.1000000000000033E-2]
{"$rows_left_out":60}
{"sheet":"T-Free Inputs","index":1,"n_rows":5,"n_cols":3,"rows_kept":5,"cut":false,"hidden":false,"merged":[]}
[]
[null,"Values from IUL Illustration","Dollar Value"]
[null,"Accumulation Value - Year before Income Starts",390747]
[null,"Annual Income Draw",45192]
[null,"Client Name","Jamie Rossi"]

{"sheet":"Calcs","index":2,"n_rows":605,"n_cols":11,"rows_kept":605,"cut":false,"hidden":false,"merged":[]}
[null,null,"Match Ratio",{"$f":"'Client Output'!C8/'Client Output'!C6","v":0},"Earnings","Taxes"]
[null,null,"Bal @Retire",{"$f":"LOOKUP((('Client Output'!C5-'Client Output'!C4)*12),Calcs!C6:C605,K6:K605)","v":465266.05122612609},{"$f":"D2*('Client Output'!C10/12)","v":2520.1911108081845},{"$f":"(E2)*('Client Output'!C11)","v":504.0382221616369}]
[]
[]
[null,null,"Month","Beg Bal","Adds","Match","Earn Bal","Earnings","Fees","Taxes","End Bal"]
[null,0,1,0,{"$f":"'Client Output'!C$6","v":1000},{"$f":"E6*D$1","v":0},{"$f":"D6+E6+F6","v":1000},{"$f":"G6*('Client Output'!C$10/12)","v":5.4166666666666696},{"$f":"-(G6+H6)*('Client Output'!C$12/12)","v":-1.2567708333333334},{"$f":"-IF('Client Output'!C$7=\"Taxable\",(H6+I6)*'Client Output'!C$11,0)","v":0},{"$f":"G6+H6+I6+J6","v":1004.1598958333333}]
[null,null,{"$f":"C6+1","v":2},{"$f":"K6","v":1004.1598958333333},{"$f":"'Client Output'!C$6","v":1000},{"$f":"E7*D$1","v":0},{"$f":"D7+E7+F7","v":2004.1598958333334},{"$f":"G7*('Client Output'!C$10/12)","v":10.855866102430561},{"$f":"-(G7+H7)*('Client Output'!C$12/12)","v":-2.5187697024197049},{"$f":"-IF('Client Output'!C$7=\"Taxable\",(H7+I7)*'Client Output'!C$11,0)","v":0},{"$f":"G7+H7+I7+J7","v":2012.4969922333444}]
[null,null,{"$f":"C7+1","v":3},{"$f":"K7","v":2012.4969922333444},{"$f":"'Client Output'!C$6","v":1000},0,{"$f":"D8+E8+F8","v":3012.4969922333444},{"$f":"G8*('Client Output'!C$10/12)","v":16.317692041263957},{"$f":"-(G8+H8)*('Client Output'!C$12/12)","v":-3.7860183553432605},{"$f":"-IF('Client Output'!C$7=\"Taxable\",(H8+I8)*'Client Output'!C$11,0)","v":0},{"$f":"G8+H8+I8+J8","v":3025.0286659192648}]
[null,null,4,3025.0286659192648,{"$f":"'Client Output'!C$6","v":1000},0,4025.0286659192648,{"$f":"G9*('Client Output'!C$10/12)","v":21.802238607062694},{"$f":"-(G9+H9)*('Client Output'!C$12/12)","v":-5.0585386306579094},{"$f":"-IF('Client Output'!C$7=\"Taxable\",(H9+I9)*'Client Output'!C$11,0)","v":0},4041.7723658956697]
[null,null,5,4041.7723658956697,{"$f":"'Client Output'!C$6","v":1000},0,5041.7723658956693,{"$f":"G10*('Client Output'!C$10/12)","v":27.309600315268224},{"$f":"-(G10+H10)*('Client Output'!C$12/12)","v":-6.336352457763673},{"$f":"-IF('Client Output'!C$7=\"Taxable\",(H10+I10)*'Client Output'!C$11,0)","v":0},5062.7456137531744]
[null,null,6,5062.7456137531744,{"$f":"'Client Output'!C$6","v":1000},0,6062.7456137531744,{"$f":"G11*('Client Output'!C$10/12)","v":32.839872074496377},{"$f":"-(G11+H11)*('Client Output'!C$12/12)","v":-7.6194818572845886},{"$f":"-IF('Client Output'!C$7=\"Taxable\",(H11+I11)*'Client Output'!C$11,0)","v":0},6087.9660039703858]
[null,null,7,6087.9660039703858,{"$f":"'Client Output'!C$6","v":1000},0,7087.9660039703858,{"$f":"G12*('Client Output'!C$10/12)","v":38.393149188172941},{"$f":"-(G12+H12)*('Client Output'!C$12/12)","v":-8.9079489414481987},{"$f":"-IF('Client Output'!C$7=\"Taxable\",(H12+I12)*'Client Output'!C$11,0)","v":0},7117.4512042171109]
[null,null,8,7117.4512042171109,{"$f":"'Client Output'!C$6","v":1000},0,8117.4512042171109,{"$f":"G13*('Client Output'!C$10/12)","v":43.969527356176037},{"$f":"-(G13+H13)*('Client Output'!C$12/12)","v":-10.201775914466609},{"$f":"-IF('Client Output'!C$7=\"Taxable\",(H13+I13)*'Client Output'!C$11,0)","v":0},8151.2189556588201]
[null,null,9,8151.2189556588201,{"$f":"'Client Output'!C$6","v":1000},0,9151.2189556588201,{"$f":"G14*('Client Output'!C$10/12)","v":49.569102676485301},{"$f":"-(G14+H14)*('Client Output'!C$12/12)","v":-11.500985072919132},{"$f":"-IF('Client Output'!C$7=\"Taxable\",(H14+I14)*'Client Output'!C$11,0)","v":0},9189.2870732623869]
[null,null,10,9189.2870732623869,{"$f":"'Client Output'!C$6","v":1000},0,10189.287073262387,{"$f":"G15*('Client Output'!C$10/12)","v":55.191971646837956},{"$f":"-(G15+H15)*('Client Output'!C$12/12)","v":-12.805598806136532},{"$f":"-IF('Client Output'!C$7=\"Taxable\",(H15+I15)*'Client Output'!C$11,0)","v":0},10231.673446103088]
[null,null,11,10231.673446103088,{"$f":"'Client Output'!C$6","v":1000},0,11231.673446103088,{"$f":"G16*('Client Output'!C$10/12)","v":60.838231166391758},{"$f":"-(G16+H16)*('Client Output'!C$12/12)","v":-14.115639596586851},{"$f":"-IF('Client Output'!C$7=\"Taxable\",(H16+I16)*'Client Output'!C$11,0)","v":0},11278.396037672894]
[null,null,12,11278.396037672894,{"$f":"'Client Output'!C$6","v":1000},0,12278.396037672894,{"$f":"G17*('Client Output'!C$10/12)","v":66.507978537394877},{"$f":"-(G17+H17)*('Client Output'!C$12/12)","v":-15.431130020262861},{"$f":"-IF('Client Output'!C$7=\"Taxable\",(H17+I17)*'Client Output'!C$11,0)","v":0},12329.472886190026]
[null,{"$f":"'Client Output'!C$9","v":1.4999999999999999E-2},13,{"$f":"K17","v":12329.472886190026},{"$f":"((E$17*(1+B$18)))","v":1014.9999999999999},0,{"$f":"D18+E18+F18","v":13344.472886190026},{"$f":"G18*('Client Output'!C$10/12)","v":72.282561466862674},{"$f":"-(G18+H18)*('Client Output'!C$12/12)","v":-16.77094430957111},{"$f":"-IF('Client Output'!C$7=\"Taxable\",(H18+I18)*'Client Output'!C$11,0)","v":0},{"$f":"G18+H18+I18+J18","v":13399.984503347316}]
[null,null,14,13399.984503347316,{"$f":"((E$17*(1+B$18)))","v":1014.9999999999999},0,{"$f":"D19+E19+F19","v":14414.984503347316},{"$f":"G19*('Client Output'!C$10/12)","v":78.081166059797994},{"$f":"-(G19+H19)*('Client Output'!C$12/12)","v":-18.116332086758892},{"$f":"-IF('Client Output'!C$7=\"Taxable\",(H19+I19)*'Client Output'!C$11,0)","v":0},{"$f":"G19+H19+I19+J19","v":14474.949337320355}]
[null,null,15,14474.949337320355,1014.9999999999999,0,15489.949337320355,{"$f":"G20*('Client Output'!C$10/12)","v":83.903892243818632},{"$f":"-(G20+H20)*('Client Output'!C$12/12)","v":-19.46731653695522},{"$f":"-IF('Client Output'!C$7=\"Taxable\",(H20+I20)*'Client Output'!C$11,0)","v":0},15554.385913027219]
[null,null,16,15554.385913027219,1014.9999999999999,0,16569.385913027218,{"$f":"G21*('Client Output'!C$10/12)","v":89.750840362230804},{"$f":"-(G21+H21)*('Client Output'!C$12/12)","v":-20.823920941736812},{"$f":"-IF('Client Output'!C$7=\"Taxable\",(H21+I21)*'Client Output'!C$11,0)","v":0},16638.312832447711]
[null,null,17,16638.312832447711,1014.9999999999999,0,17653.312832447711,{"$f":"G22*('Client Output'!C$10/12)","v":95.622111175758491},{"$f":"-(G22+H22)*('Client Output'!C$12/12)","v":-22.186168679529338},{"$f":"-IF('Client Output'!C$7=\"Taxable\",(H22+I22)*'Client Output'!C$11,0)","v":0},17726.748774943939]
[null,null,18,17726.748774943939,1014.9999999999999,0,18741.748774943939,{"$f":"G23*('Client Output'!C$10/12)","v":101.51780586427972},{"$f":"-(G23+H23)*('Client Output'!C$12/12)","v":-23.554083226010274},{"$f":"-IF('Client Output'!C$7=\"Taxable\",(H23+I23)*'Client Output'!C$11,0)","v":0},18819.712497582212]
[null,null,19,18819.712497582212,1014.9999999999999,0,19834.712497582212,{"$f":"G24*('Client Output'!C$10/12)","v":107.43802602857036},{"$f":"-(G24+H24)*('Client Output'!C$12/12)","v":-24.927688154513476},{"$f":"-IF('Client Output'!C$7=\"Taxable\",(H24+I24)*'Client Output'!C$11,0)","v":0},19917.222835456269]
[null,null,20,19917.222835456269,1014.9999999999999,0,20932.222835456269,{"$f":"G25*('Client Output'!C$10/12)","v":113.38287369205484},{"$f":"-(G25+H25)*('Client Output'!C$12/12)","v":-26.307007136435406},{"$f":"-IF('Client Output'!C$7=\"Taxable\",(H25+I25)*'Client Output'!C$11,0)","v":0},21019.298702011889]
[null,null,21,21019.298702011889,1014.9999999999999,0,22034.298702011889,{"$f":"G26*('Client Output'!C$10/12)","v":119.35245130256446},{"$f":"-(G26+H26)*('Client Output'!C$12/12)","v":-27.69206394164307},{"$f":"-IF('Client Output'!C$7=\"Taxable\",(H26+I26)*'Client Output'!C$11,0)","v":0},22125.959089372813]
[null,null,22,22125.959089372813,1014.9999999999999,0,23140.959089372813,{"$f":"G27*('Client Output'!C$10/12)","v":125.3468617341028},{"$f":"-(G27+H27)*('Client Output'!C$12/12)","v":-29.082882438883644},{"$f":"-IF('Client Output'!C$7=\"Taxable\",(H27+I27)*'Client Output'!C$11,0)","v":0},23237.22306866803]
[null,null,23,23237.22306866803,1014.9999999999999,0,24252.22306866803,{"$f":"G28*('Client Output'!C$10/12)","v":131.36620828861857},{"$f":"-(G28+H28)*('Client Output'!C$12/12)","v":-30.479486596195812},{"$f":"-IF('Client Output'!C$7=\"Taxable\",(H28+I28)*'Client Output'!C$11,0)","v":0},24353.109790360453]
[null,null,24,24353.109790360453,1014.9999999999999,0,25368.109790360453,{"$f":"G29*('Client Output'!C$10/12)","v":137.41059469778585},{"$f":"-(G29+H29)*('Client Output'!C$12/12)","v":-31.881900481322802},{"$f":"-IF('Client Output'!C$7=\"Taxable\",(H29+I29)*'Client Output'!C$11,0)","v":0},25473.638484576917]
[null,{"$f":"'Client Output'!C$9","v":1.4999999999999999E-2},25,25473.638484576917,{"$f":"((E$29*(1+B$30)))","v":1030.2249999999997},0,26503.863484576916,{"$f":"G30*('Client Output'!C$10/12)","v":143.5625938747917},{"$f":"-(G30+H30)*('Client Output'!C$12/12)","v":-33.309282598064634},{"$f":"-IF('Client Output'!C$7=\"Taxable\",(H30+I30)*'Client Output'!C$11,0)","v":0},26614.116795853643]
[null,null,26,26614.116795853643,{"$f":"((E$29*(1+B$30)))","v":1030.2249999999997},0,27644.341795853641,{"$f":"G31*('Client Output'!C$10/12)","v":149.74018472754062},{"$f":"-(G31+H31)*('Client Output'!C$12/12)","v":-34.742602475726478},{"$f":"-IF('Client Output'!C$7=\"Taxable\",(H31+I31)*'Client Output'!C$11,0)","v":0},27759.339378105455]
[null,null,27,27759.339378105455,1030.2249999999997,0,28789.564378105453,{"$f":"G32*('Client Output'!C$10/12)","v":155.94347371473796},{"$f":"-(G32+H32)*('Client Output'!C$12/12)","v":-36.181884814775238},{"$f":"-IF('Client Output'!C$7=\"Taxable\",(H32+I32)*'Client Output'!C$11,0)","v":0},28909.325967005418]
[null,null,28,28909.325967005418,1030.2249999999997,0,29939.550967005416,{"$f":"G33*('Client Output'!C$10/12)","v":162.17256773794608},{"$f":"-(G33+H33)*('Client Output'!C$12/12)","v":-37.627154418429207},{"$f":"-IF('Client Output'!C$7=\"Taxable\",(H33+I33)*'Client Output'!C$11,0)","v":0},30064.096380324932]
[null,null,29,30064.096380324932,1030.2249999999997,0,31094.321380324931,{"$f":"G34*('Client Output'!C$10/12)","v":168.4275741434268},{"$f":"-(G34+H34)*('Client Output'!C$12/12)","v":-39.078436193085452},{"$f":"-IF('Client Output'!C$7=\"Taxable\",(H34+I34)*'Client Output'!C$11,0)","v":0},31223.670518275274]
[null,null,30,31223.670518275274,1030.2249999999997,0,32253.895518275272,{"$f":"G35*('Client Output'!C$10/12)","v":174.70860072399114},{"$f":"-(G35+H35)*('Client Output'!C$12/12)","v":-40.535755148749082},{"$f":"-IF('Client Output'!C$7=\"Taxable\",(H35+I35)*'Client Output'!C$11,0)","v":0},32388.068363850514]
[null,null,31,32388.068363850514,1030.2249999999997,0,33418.293363850513,{"$f":"G36*('Client Output'!C$10/12)","v":181.01575572085704},{"$f":"-(G36+H36)*('Client Output'!C$12/12)","v":-41.999136399464213},{"$f":"-IF('Client Output'!C$7=\"Taxable\",(H36+I36)*'Client Output'!C$11,0)","v":0},33557.309983171908]
[null,null,32,33557.309983171908,1030.2249999999997,0,34587.534983171907,{"$f":"G37*('Client Output'!C$10/12)","v":187.34914782551459},{"$f":"-(G37+H37)*('Client Output'!C$12/12)","v":-43.46860516374678},{"$f":"-IF('Client Output'!C$7=\"Taxable\",(H37+I37)*'Client Output'!C$11,0)","v":0},34731.415525833676]
[null,null,33,34731.415525833676,1030.2249999999997,0,35761.640525833674,{"$f":"G38*('Client Output'!C$10/12)","v":193.70888618159918},{"$f":"-(G38+H38)*('Client Output'!C$12/12)","v":-44.944186765019097},{"$f":"-IF('Client Output'!C$7=\"Taxable\",(H38+I38)*'Client Output'!C$11,0)","v":0},35910.405225250259]
[null,null,34,35910.405225250259,1030.2249999999997,0,36940.630225250257,{"$f":"G39*('Client Output'!C$10/12)","v":200.09508038677234},{"$f":"-(G39+H39)*('Client Output'!C$12/12)","v":-46.425906632046292},{"$f":"-IF('Client Output'!C$7=\"Taxable\",(H39+I39)*'Client Output'!C$11,0)","v":0},37094.299399004987]
[null,null,35,37094.299399004987,1030.2249999999997,0,38124.524399004986,{"$f":"G40*('Client Output'!C$10/12)","v":206.50784049461043},{"$f":"-(G40+H40)*('Client Output'!C$12/12)","v":-47.913790299374497},{"$f":"-IF('Client Output'!C$7=\"Taxable\",(H40+I40)*'Client Output'!C$11,0)","v":0},38283.118449200221]
{"$rows_left_out":565}